{"text_format":"3","workbook":"xlsx","n_sheets":7,"sheets":["Instructions","Application O","Application A","Application B","S73 Calc","Terms of Use","Change Log"],"not_rendered":{"comments":5},"read":"whole","date_system":"1900"}

{"sheet":"Instructions","index":0,"n_rows":50,"n_cols":3,"rows_kept":50,"merged":[[10,0,10,8],[11,0,11,8],[12,0,12,8],[13,0,13,8],[14,0,14,8],[19,0,19,7],[33,0,35,11]]}
[{"$f":"CONCATENATE(\"Exacom S73 Calculator Version \",'Terms of Use'!C3)","v":"Exacom S73 Calculator Version 1.11"}]
["How many places to round indexation to?"]
[]
["Initial Steps"]
[]
["Answer the question above as to how many decimal places to round your indexation result to. If you leave this blank, then no rounding is done on the indexation. If you enter a number, then indexation will be rounded to that number of decimal places  "]
[]
[]
["Next Steps"]
[]
["IMPORTANT: At the top of the 'Application A' tab, set whether 'Application A' (the Previous application) is an Original application, or a Section 73 itself. This is needed for the calculations should the liability decrease between 'A' and 'B'. In this scenario we need certain values from the Original. The Original App details will then need to be filled out. An \"Application O\" button will appear to facilitate this."]
["To ensure the sheet always starts with zeros and doesn't have any stray values, ensure you open the XLTX (Template) file. This will open a brand new copy of that template, instead of the template itself. This will preserve the original."]
["Ensure you're always using the latest version of this spreadsheet. The version is at the top of this page and there is a Change Log sheet below with details of any changes. Please always check our  website for the latest."]
["Fill out the tabs for 'Application A' and 'Application B' to determine whether the notional amount has changed. Ensure you check every box that is coloured in these 2 tabs. The values in Application A must represent your PREVIOUS application. The values in Application B must represent your SUPERSEDING application. For the notional value calculation, the 'Application B' tab allows you to switch between using the Demolition and Retained use values from 'Application A' or 'Application B' to accommodate different circumstances (e.g. \"in use\" rule lapsing)"]
["If demolition changes from application to application you will be prompted to choose whether that demolition changed because of a change in the planning application, or because the demolition failed the \"In Use\" rule. This prompt appears to the right of the Demolition value. \nSimilar prompts appear for Retained use and appear below the social housing box for each use. These need to be answered for each \"use\" that changes."]
["Click on this button to proceed to Application A (the Preceding Application):",null,"Application A"]
[]
["Other advice"]
[]
["Click here to open up Schedule 1 from the September 2019 regulation amendments"]
{"$rows_left_out":31}
{"sheet":"Application O","index":1,"n_rows":75,"n_cols":6,"rows_kept":75}
[null,"Site Calculator - Application O (Original Application)",null,null,"NOTE: YOU DON'T NEED TO FILL THIS IN! GO BACK!"]
[]
[null,"THIS APPLICATION",{"$nulls":3},"Application A"]
[]
[null,"IP as at effective decision date for this application",0,null,null,"Application B"]
[null,"IC from Charging Schedule for this application",0]
[{"$nulls":5},"S73 Calculation"]
[null,"Site Demolition",{"v":0,"d":"0.00"}]
[{"$nulls":5},"Instructions"]
[]
[]
[null,{"$f":"'Application A'!B12","v":"Use 1"},null,null,{"$f":"CONCATENATE(B12,\" Relief\")","v":"Use 1 Relief"}]
[]
[null,"Rate for this use",{"v":0,"d":"£0.00"},null,"Gross Social Housing area for this use",{"v":0,"d":"0.00"}]
[null,"Gross Area for this Use",{"v":0,"d":"0.00"},null,"Amount of retained use within this relief area",{"v":0,"d":"0.00"}]
[null,"Retained area for this use only",{"v":0,"d":"0.00"},null,"Net Social Housing Area",{"$f":"F14-F15-(F14*C$8/(IF($F$72=0,1,$F$72)))","v":{"v":0,"d":"0.00"}}]
[null,"Net Area",{"$f":"C15-C16-($C$8*C15/IF($F$72=0,1,$F$72))","v":{"v":0,"d":"0.00"}},null,"Notional Social Housing Relief",{"$f":"ROUND(IF(Instructions!B$2<>\"\",C14*F16*ROUND(C$5/IF($C$6=0,1,$C$6),Instructions!B$2),C14*F16*C$5/IF($C$6=0,1,$C$6)),2)","v":{"v":0,"d":"£0.00"}}]
[null,"Notional Charge Before Relief",{"$f":"ROUND(IF(Instructions!B$2<>\"\",C17*C14*ROUND(C$5/IF($C$6=0,1,$C$6),Instructions!B$2),C17*C14*C$5/IF($C$6=0,1,$C$6)),2)","v":{"v":0,"d":"£0.00"}}]
[null,{"$f":"CONCATENATE(B12, \" Notional Charge After Relief\")","v":"Use 1 Notional Charge After Relief"},{"$f":"C18-F17","v":{"v":0,"d":"£0.00"}}]
[]
{"$rows_left_out":56}
{"sheet":"Application A","index":2,"n_rows":87,"n_cols":6,"rows_kept":87}
[null,"Site Calculator - Application A (Previous Application)",null,null,"Is this an ORIGINAL APPLICATION or a SECTION 73?","Original"]
[]
[null,"THIS APPLICATION",null,null,"As this tab is a S73, you must fill out the App O:    ----->","Application O"]
[]
[null,"IP as at effective decision date for this application",0,null,null,"Application B"]
[null,"IC from Charging Schedule for this application",0]
[{"$nulls":5},"S73 Calculation"]
[null,"Site Demolition",{"v":0,"d":"0.00"},null,"Why has demolition changed?","It just changed"]
[{"$nulls":5},"Instructions"]
[]
[]
[null,"Use 1",null,null,{"$f":"CONCATENATE(B12,\" Relief\")","v":"Use 1 Relief"}]
[]
[null,"Rate for this use",{"v":0,"d":"£0.00"},null,"Gross Social Housing area for this use",{"v":0,"d":"0.00"}]
[null,"Gross Area for this Use",{"v":0,"d":"0.00"},null,"Amount of retained use within this relief area",{"v":0,"d":"0.00"}]
[null,"Retained area for this use only",{"v":0,"d":"0.00"},null,"Net Social Housing Area",{"$f":"F14-F15-(F14*C$8/(IF($F$84=0,1,$F$84)))","v":{"v":0,"d":"0.00"}}]
[null,"Net Area",{"$f":"C15-C16-($C$8*C15/IF($F$84=0,1,$F$84))","v":{"v":0,"d":"0.00"}},null,"Notional Social Housing Relief",{"$f":"ROUND(IF(Instructions!B$2<>\"\",C14*F16*ROUND(C$5/IF($C$6=0,1,$C$6),Instructions!B$2),C14*F16*C$5/IF($C$6=0,1,$C$6)),2)","v":{"v":0,"d":"£0.00"}}]
[null,"Notional Charge Before Relief",{"$f":"ROUND(IF(Instructions!B$2<>\"\",C17*C14*ROUND(C$5/IF($C$6=0,1,$C$6),Instructions!B$2),C17*C14*C$5/IF($C$6=0,1,$C$6)),2)","v":{"v":0,"d":"£0.00"}}]
[null,{"$f":"CONCATENATE(B12, \" Notional Charge After Relief\")","v":"Use 1 Notional Charge After Relief"},{"$f":"C18-F17","v":{"v":0,"d":"£0.00"}},null,"Why has the retained area changed?","It just changed"]
[]
{"$rows_left_out":68}
{"sheet":"Application B","index":3,"n_rows":87,"n_cols":13,"rows_kept":87}
[null,"Site Calculator - Application B (Superseding Section 73 Application)",{"$nulls":6},"Notional Value Calculations"]
[{"$nulls":5},"Application O"]
[null,"THIS APPLICATION",{"$nulls":6},"NOTIONAL RATES",null,null,"Demolition and Retained from :","This App"]
[{"$nulls":5},"Application A"]
[null,"IP as at effective decision date for this application",0,{"$nulls":5},"IP used",{"$f":"'Application A'!C5","v":0}]
[null,"IC from Charging Schedule for this application",0,null,null,"S73 Calculation",null,null,"IC used",{"$f":"'Application A'!C6","v":0}]
[]
[null,"Site Demolition",{"v":0,"d":"0.00"},null,"Why has demolition changed?","It just changed",null,null,"Demolition used",{"$f":"IF($M$3=\"Previous App\",'Application A'!C8,C8)","v":{"v":0,"d":"0.00"}}]
[]
[{"$nulls":5},"Instructions"]
[]
[null,{"$f":"'Application A'!B12","v":"Use 1"},null,null,{"$f":"CONCATENATE(B12,\" Relief\")","v":"Use 1 Relief"},{"$nulls":3},{"$f":"'Application A'!B12","v":"Use 1"},null,null,{"$f":"CONCATENATE(I12,\" Relief\")","v":"Use 1 Relief"}]
[]
[null,"Rate for this use",{"v":0,"d":"£0.00"},null,"Gross Social Housing area for this use",{"v":0,"d":"0.00"},null,null,"Rate used",{"$f":"'Application A'!C14","v":{"v":0,"d":"£0.00"}},null,"Gross Social Housing area used",{"$f":"F14","v":{"v":0,"d":"0.00"}}]
[null,"Gross Area for this Use",{"v":0,"d":"0.00"},null,"Amount of retained use within this relief area",{"v":0,"d":"0.00"},null,null,"Gross Area used",{"$f":"C15","v":{"v":0,"d":"0.00"}},null,"Relief retained area used",{"$f":"IF($M$3=\"Previous App\",'Application A'!F15,F15)","v":{"v":0,"d":"0.00"}}]
[null,"Retained area for this use only",{"v":0,"d":"0.00"},null,"Net Social Housing Area",{"$f":"F14-F15-(F14*C$8/(IF($F$84=0,1,$F$84)))","v":{"v":0,"d":"0.00"}},null,null,"Retained area used",{"$f":"IF($M$3=\"Previous App\",'Application A'!C16,C16)","v":{"v":0,"d":"0.00"}},null,"Net Social Housing Area",{"$f":"IF(M14-M15-(M14*$J$8/(IF($F$84=0,1,$F$84)))<=0,0,M14-M15-(M14*$J$8/(IF($F$84=0,1,$F$84))))","v":{"v":0,"d":"0.00"}}]
[null,"Net Area",{"$f":"C15-C16-(C$8*C15/(IF($F$84=0,1,$F$84)))","v":{"v":0,"d":"0.00"}},null,"Net Value Social Housing Net Relief",{"$f":"ROUND(IF(Instructions!B$2<>\"\",C14*F16*ROUND(C$5/IF($C$6=0,1,$C$6),Instructions!B$2),C14*F16*C$5/IF($C$6=0,1,$C$6)),2)","v":{"v":0,"d":"£0.00"}},null,null,"Net Area used",{"$f":"J15-J16-(J$8*J15/(IF($F$84=0,1,$F$84)))","v":{"v":0,"d":"0.00"}},null,"Notional Social Housing Relief",{"$f":"ROUND(IF(Instructions!B$2<>\"\",M16*J14*ROUND(J$5/IF(J$6=0,1,J$6),Instructions!B$2),M16*J14*J$5/IF(J$6=0,1,J$6)),2)","v":{"v":0,"d":"£0.00"}}]
[null,"Liability Before Relief",{"$f":"ROUND(IF(Instructions!B$2<>\"\",C17*C14*ROUND(C$5/IF($C$6=0,1,$C$6),Instructions!B$2),C17*C14*C$5/IF($C$6=0,1,$C$6)),2)","v":{"v":0,"d":"£0.00"}},{"$nulls":5},"Notional Amount Before Relief",{"$f":"ROUND(IF(Instructions!B$2<>\"\",J17*J14*ROUND(J$5/IF(J$6=0,1,J$6),Instructions!B$2),J17*J14*J$5/IF(J$6=0,1,J$6)),2)","v":{"v":0,"d":"£0.00"}}]
[null,{"$f":"CONCATENATE(B12, \" Liability After Relief\")","v":"Use 1 Liability After Relief"},{"$f":"C18-F17","v":{"v":0,"d":"£0.00"}},null,"Why has the retained area changed?","It just changed"]
[]
{"$rows_left_out":68}
{"sheet":"S73 Calc","index":4,"n_rows":121,"n_cols":15,"rows_kept":121,"merged":[[7,1,7,4],[8,1,8,3],[11,7,11,8],[11,12,11,13],[28,6,28,7],[28,8,28,9],[46,6,46,7],[46,8,46,9],[64,6,64,7],[64,8,64,9],[82,6,82,7],[82,8,82,9],[100,6,100,7],[100,8,100,9],[118,6,118,7],[118,8,118,9]]}
[null,"Resulting S73 Calculation"]
[]
[null,"Which rule applies?",{"$nulls":10},"Application O"]
[{"$nulls":3},"Gross Liability","Relief Value"]
[null,"Liability - Application A",null,{"$f":"'Application A'!C84","v":{"v":0,"d":"£0.00"}},{"$f":"'Application A'!C85+'Application A'!C78","v":{"v":0,"d":"£0.00"}},{"$nulls":7},"Application A"]
[null,"Liability - Application B (Notional)",null,{"$f":"'Application B'!C84","v":{"v":0,"d":"£0.00"}},{"$f":"'Application B'!C85+'Application B'!C78","v":{"v":0,"d":"£0.00"}}]
[{"$nulls":6},"Which Schedule 1 paragraph applies?",null,null,{"$f":"IF((D6-E6)=(D5-E5),3,IF((D6-E6)>(D5-E5),4,5))","v":3},null,null,"Application B"]
[null,{"$f":"IF((D6-E6)=(D5-E5),\"Liability has stayed the same\",IF((D6-E6)>(D5-E5),\"Liability has increased\",\"Liability has descreased\"))","v":"Liability has stayed the same"},{"$nulls":4},"Are we using values from Application O?",null,null,{"$f":"IF(AND('Application A'!F1=\"Section 73\",J7=5),TRUE,FALSE)","v":false}]
[{"$nulls":12},"Instructions"]
[null,"Chargeable Amount Formula",null,{"$f":"IF((D6-E6)=(D5-E5),\"As per P 3(1)a\",\"(X-Y)+Z\")","v":"As per P 3(1)a"}]
[null,"Relief Formula",null,{"$f":"IF(D6=D5,\"As per P 3(1)a\",\"(Rx-Ry)+Rz\")","v":"As per P 3(1)a"}]
[{"$nulls":7},"Liability Workings",{"$nulls":4},"Relief Workings"]
[null,{"$f":"'Application A'!B12","v":"Use 1"},{"$nulls":4},"Which Rule?","Increase","Decrease","Decrease",null,"Which Rule?","Increase","Decrease","Decrease"]
[null,null,"App","Liability ","Relief ",{"$nulls":3},"2 Apps","> 2 Apps",{"$nulls":3},"2 Apps","> 2 Apps"]
[null,"Area for X",{"$f":"IF($J$7=3,\"N/A\",IF($J$7=4,\"B\",IF($J$8=FALSE,\"B\",\"B\")))","v":"N/A"},{"$f":"IF($J$7=3,\"\",IF($J$7=4,H15,IF($J$8=FALSE,I15,J15)))","v":""},{"$f":"IF($J$7=3,\"\",IF($J$7=4,M15,IF($J$8=FALSE,N15,O15)))","v":""},null,"X Area",{"$f":"'Application B'!$C$17","v":{"v":0,"d":"0.00"}},{"$f":"'Application B'!C15-IF(AND('Application B'!$F19='Terms of Use'!$C$14,'Application B'!$C16<>'Application A'!$C16),'Application A'!C16, 'Application B'!C16)-(IF(AND('Application B'!$F$8='Terms of Use'!$C$14,'Application B'!$C$8<>'Application A'!$C$8), 'Application A'!$C$8,'Application B'!$C$8)*'Application B'!C15/IF('Application B'!$F$84=0,1,'Application B'!$F$84))","v":{"v":0,"d":"0.00"}},{"$f":"'Application B'!C15-IF(AND('Application B'!$F19='Terms of Use'!$C$14,'Application B'!$C16<>'Application O'!$C16),'Application O'!C16, 'Application B'!C16)-(IF(AND('Application B'!$F$8='Terms of Use'!$C$14,'Application B'!$C$8<>'Application O'!$C$8), 'Application O'!$C$8,'Application B'!$C$8)*'Application B'!C15/IF('Application B'!$F$84=0,1,'Application B'!$F$84))","v":{"v":0,"d":"0.00"}},null,"Rx Area",{"$f":"'Application B'!$F$16","v":{"v":0,"d":"0.00"}},{"$f":"'Application B'!F14-IF(AND('Application B'!$F19='Terms of Use'!$C$14,'Application B'!$F15<>'Application A'!$F15),'Application A'!F15, 'Application B'!F15)-(IF(AND('Application B'!$F$8='Terms of Use'!$C$14,'Application B'!$C$8<>'Application A'!$C$8), 'Application A'!$C$8,'Application B'!$C$8)*'Application B'!F14/(IF('Application B'!$F$84=0,1,'Application B'!$F$84)))","v":{"v":0,"d":"0.00"}},{"$f":"'Application B'!F14-IF(AND('Application B'!$F19='Terms of Use'!$C$14,'Application B'!$F15<>'Application O'!$F15),'Application O'!F15, 'Application B'!F15)-(IF(AND('Application B'!$F$8='Terms of Use'!$C$14,'Application B'!$C$8<>'Application O'!$C$8), 'Application O'!$C$8,'Application B'!$C$8)*'Application B'!F14/(IF('Application B'!$F$84=0,1,'Application B'!$F$84)))","v":{"v":0,"d":"0.00"}}]
[null,"Rate used for X",{"$f":"IF($J$7=3,\"N/A\",IF($J$7=4,\"B\",IF($J$8=FALSE,\"A\",\"O\")))","v":"N/A"},"","",null,"X Rate",{"$f":"'Application B'!$C$14","v":{"v":0,"d":"£0.00"}},{"$f":"'Application A'!$C$14","v":{"v":0,"d":"£0.00"}},{"$f":"'Application O'!$C14","v":{"v":0,"d":"£0.00"}},null,"Rx Rate",{"$f":"'Application B'!$C$14","v":{"v":0,"d":"£0.00"}},{"$f":"'Application A'!$C$14","v":{"v":0,"d":"£0.00"}},{"$f":"'Application O'!$C$14","v":{"v":0,"d":"£0.00"}}]
[null,"IP used for X",{"$f":"IF($J$7=3,\"N/A\",IF($J$7=4,\"B\",IF($J$8=FALSE,\"A\",\"O\")))","v":"N/A"},{"$f":"IF($J$7=3,\"\",IF($J$7=4,H17,IF($J$8=FALSE,I17,J17)))","v":""},{"$f":"IF($J$7=3,\"\",IF($J$7=4,M17,IF($J$8=FALSE,N17,O17)))","v":""},null,"X IP",{"$f":"'Application B'!$C$5","v":0},{"$f":"'Application A'!$C$5","v":0},{"$f":"'Application O'!$C$5","v":0},null,"Rx IP",{"$f":"'Application B'!C5","v":0},{"$f":"'Application A'!$C$5","v":0},{"$f":"'Application O'!$C$5","v":0}]
[null,"IC used for X",{"$f":"IF($J$7=3,\"N/A\",IF($J$7=4,\"B\",IF($J$8=FALSE,\"A\",\"O\")))","v":"N/A"},"","",null,"X IC",{"$f":"'Application B'!$C$6","v":0},{"$f":"'Application A'!$C$6","v":0},{"$f":"'Application O'!$C$6","v":0},null,"Rx IC",{"$f":"'Application B'!$C$6","v":0},{"$f":"'Application A'!$C$6","v":0},{"$f":"'Application O'!$C$6","v":0}]
[null,"Total for X",null,"","",null,"X TOTAL",{"$f":"ROUND(IF(Instructions!B$2=\"\",H16*H15*H17/IF(H18=0,1,H18),H16*H15*ROUND(H17/IF(H18=0,1,H18),Instructions!B$2)),2)","v":{"v":0,"d":"£0.00"}},{"$f":"ROUND(IF(Instructions!B$2=\"\",I16*I15*I17/IF(I18=0,1,I18),I16*I15*ROUND(I17/IF(I18=0,1,I18),Instructions!B$2)),2)","v":{"v":0,"d":"£0.00"}},{"$f":"ROUND(IF(Instructions!$B$2=\"\",J16*J15*J17/IF(J18=0,1,J18),J16*J15*ROUND(J17/IF(J18=0,1,J18),Instructions!$B$2)),2)","v":{"v":0,"d":"£0.00"}},null,"Rx TOTAL",{"$f":"ROUND(IF(Instructions!$B$2=\"\",M16*M15*M17/IF(M18=0,1,M18),M16*M15*ROUND(M17/IF(M18=0,1,M18),Instructions!$B$2)),2)","v":{"v":0,"d":"£0.00"}},{"$f":"ROUND(IF(Instructions!$B$2=\"\",N16*N15*N17/IF(N18=0,1,N18),N16*N15*ROUND(N17/IF(N18=0,1,N18),Instructions!$B$2)),2)","v":{"v":0,"d":"£0.00"}},{"$f":"ROUND(IF(Instructions!$B$2=\"\",O16*O15*O17/IF(O18=0,1,O18),O16*O15*ROUND(O17/IF(O18=0,1,O18),Instructions!$B$2)),2)","v":{"v":0,"d":"£0.00"}}]
[null,"Area for Y",{"$f":"IF($J$7=3,\"N/A\",IF($J$7=4,\"A\",IF($J$8=FALSE,\"A\",\"A\")))","v":"N/A"},"","",null,"Y Area",{"$f":"'Application A'!C15-IF(AND('Application B'!$F19='Terms of Use'!$C$14,'Application B'!$C16<>'Application A'!$C16),'Application B'!C16, 'Application A'!C16)-(IF(AND('Application B'!$F$8='Terms of Use'!$C$14,'Application B'!$C$8<>'Application A'!$C$8), 'Application B'!$C$8,'Application A'!$C$8)*'Application A'!C15/IF('Application A'!$F$84=0,1,'Application A'!$F$84))","v":{"v":0,"d":"0.00"}},{"$f":"'Application A'!$C$17","v":{"v":0,"d":"0.00"}},{"$f":"'Application A'!C15-IF(AND('Application A'!$F19='Terms of Use'!$C$14,'Application O'!$C16<>'Application A'!$C16),'Application O'!C16, 'Application A'!C16)-(IF(AND('Application A'!$F$8='Terms of Use'!$C$14,'Application O'!$C$8<>'Application A'!$C$8), 'Application O'!$C$8,'Application A'!$C$8)*'Application A'!C15/IF('Application A'!$F$84=0,1,'Application A'!$F$84))","v":{"v":0,"d":"0.00"}},null,"Ry Area",{"$f":"'Application A'!F14-IF(AND('Application B'!$F19='Terms of Use'!$C$14,'Application B'!$F15<>'Application A'!$F15),'Application B'!F15, 'Application A'!F15)-(IF(AND('Application B'!$F$8='Terms of Use'!$C$14,'Application B'!$C$8<>'Application A'!$C$8), 'Application B'!$C$8,'Application A'!$C$8)*'Application A'!F14/(IF('Application A'!$F$84=0,1,'Application A'!$F$84)))","v":{"v":0,"d":"0.00"}},{"$f":"'Application A'!$F$16","v":{"v":0,"d":"0.00"}},{"$f":"'Application A'!F14-IF(AND('Application A'!$F19='Terms of Use'!$C$14,'Application A'!$F15<>'Application O'!$F15),'Application O'!F15, 'Application A'!F15)-(IF(AND('Application A'!$F$8='Terms of Use'!$C$14,'Application A'!$C$8<>'Application O'!$C$8), 'Application O'!$C$8,'Application A'!$C$8)*'Application A'!F14/(IF('Application A'!$F$84=0,1,'Application A'!$F$84)))","v":{"v":0,"d":"0.00"}}]
{"$rows_left_out":102}
{"sheet":"Terms of Use","index":5,"n_rows":15,"n_cols":3,"rows_kept":15,"merged":[[3,0,3,4]]}
["These terms of use should accompany any copy of this workbook."]
[]
["Workbook Version",null,"1.11"]
["Workbook created following the September 2019 amendments"]
["The workbook is provided as is and includes no warranties. By using this you agree to using it at your own risk!"]
[]
["Return to",null,"Instructions"]
[]
[]
[null,null,"Original"]
[null,null,"Section 73"]
[null,null,"This App"]
[null,null,"Previous App"]
[null,null,"Fails \"In Use\" Rule"]
[null,null,"It just changed"]

{"sheet":"Change Log","index":6,"n_rows":15,"n_cols":6,"rows_kept":15}
["Change log"]
[{"$nulls":3},"Return to",null,"Instructions"]
[1.2,"First Live Version"]
[1.3,"Adjusted the handling of Demolition/Retained to add functionality to deal with those cases where the  six month in three year rule no longer applies because of the time lapse between the two permissions - P4 and Notional"]
[1.4,"Re-introduced \"Application O\" sheet (in place of a values box previously in \"Application A\") and better handling of Demolition in scenarios where it originally applied but no longer applied (particularly with Application O in Paragraph 5 scenarios). Formulas modified to accommodate and optimise various scenarios. Rounding removed from SQM area calculations. Buttons replace tabs and workbook locked down"]
[1.5,"Expanded the area components (X and Y Gross and Relief area) in the S73 Calculation sheet to include 14 decimal places to ease copying to the v312 Exacom system, which now accepts higher precision values"]
[1.6,"Visual changes to the totals at the bottom of Application A to remove ambiguity (no impact on any S73 calculation)"]
[1.7,"Modified workbook to extend from 3 to 6 uses. Changed \"Show cells with 0 in them\" to TRUE (previously hidden)"]
[1.7,"Added the ability to copy a string of data for each use from the summary page to import into the Exacom system (Exacom v313+ required to utilise this new feature)"]
[1.8,"Net Area's for Application O were being rounded. This affected the Net Area and therefore Notional Value within the O tab (but did not affect the resulting S73 calculation, as that is separate)"]
[1.9,"Improved compatibility with Office 2016"]
[{"v":1.1,"d":"1.10"},"The spreadsheet will now copy Z (Liability Notice) data for Paragraph 3 cases so that import strings can be generated for S73 applications where no increase in liability occurs."]
[null,"Improved Application B to report pre and post relief values in the same way as Application A (Totals at bottom of page)"]
[null,"Improved the Notional Totals box on the Calculations page to better mirror the data required for import into Exacom's authority totals area"]
[1.11,"Fixed a bug where Other Relief was not being accounted for correctly on the summary page"]